{"text_format":"1","workbook":"xlsx","n_sheets":11,"sheets":["Introductie","Stap 1 Risicomatrix","Stap 2 Register","Stap 3 Maatregelen","Overgebleven risico","1e berekening","Grafiek1","Dashboard","Verantwoording","BW tabel","Grafiek"],"not_rendered":{"charts":5,"images":4,"macros":1,"external_links":0,"defined_names":10,"comments":0,"pivot_tables":1},"unopened":[{"sheet":"Grafiek1","index":6,"reason":"not_a_worksheet"}],"bounds":{"document_bytes":16777216,"sheet_cells":100000,"rows_first":2000,"rows_last":500,"rows_between":2000,"halvings":0,"cell_chars":16384,"cell_head_chars":4096},"cells_cut":0,"cells_raw":0,"read":"whole","date_system":"1900"}

{"sheet":"Introductie","index":0,"n_rows":53,"n_cols":17,"rows_kept":53,"cut":false,"hidden":false,"merged":[[4,1,19,8],[21,1,34,8],[36,1,50,5],[36,6,43,10],[44,6,52,10],[52,1,59,5]]}
[]
[null,null,"Assetmanagement Risico Register (ARR)"]
[null,null,null,null,null,null,null,"Een Lean inzicht van uw assetmanagement risicopositie"]
[]
[null,"INTRODUCTIE\nLEAM Advies, kortweg LEAM, is een zelfstandig organisatie adviesbureau. LEAM staat voor de integratie van de filosofie van Lean met de wereld van Asset Management. LEAM heeft o.a. als doel om Asset Management zo praktisch mogelijk handen en voeten te geven op een wijze die past binnen uw organisatie. Dit op een manier zonder de bestaande richtlijnen uit het oog te verliezen. LEAM zorgt voor verandering door het ontwikkelen van het leervermogen in uw organisatie toepasbaar te maken. Daarbij kunnen instrumenten ondersteunend zijn, zoals dit Assetmanagement Risico Register.\n\nDit register helpt bij het vastleggen van uw risico's. Van elk ingevoerde gebeurtenis kan het risico worden bepaald aan de hand van een bedrijfswaardentabel. De risicopositie wordt weergegeven, evenals het \"monetair equivalent\". Dit is het risico uitgedrukt in geld. Het risicoregister (of deze ARR) wordt gebruikt in stap 2 van de zeven assetmanagement stappen. Deze stappen staan beschreven op de website van LEAM. Klik op het logo om hier naartoe te gaan. De ARR levert naast een overzicht van het totaal aan risico's ook een beeld van alle risico's op. Dit kan eenvoudig worden geprint. In dit register kunnen ook maatregelen ingevuld worden en het verwachte risiconiveau na het nemen van de maatregelen. \n\n"]
[]
[]
[]
{"$rows_left_out":46}
{"sheet":"Stap 1 Risicomatrix","index":1,"n_rows":20,"n_cols":15,"rows_kept":20,"cut":false,"hidden":false,"merged":[[2,9,3,14],[4,8,6,8],[5,2,5,7],[7,0,18,0],[7,1,8,1],[7,8,8,8],[7,9,8,9],[7,10,8,10],[7,11,8,11],[7,12,8,12],[7,13,8,13],[7,14,8,14],[9,1,10,1],[9,8,10,8],[9,9,10,9],[9,10,10,10],[9,11,10,11],[9,12,10,12],[15,13,16,13],[15,14,16,14],[11,13,12,13],[13,12,14,12],[13,13,14,13],[11,12,12,12],[13,1,14,1],[13,8,14,8],[13,9,14,9],[13,10,14,10],[13,11,14,11],[11,1,12,1],[11,8,12,8],[11,9,12,9],[11,10,12,10],[11,11,12,11],[17,13,18,13],[17,14,18,14],[10,4,15,6],[17,1,18,1],[17,8,18,8],[17,9,18,9],[17,10,18,10],[17,11,18,11],[17,12,18,12],[13,14,14,14],[15,1,16,1],[15,8,16,8],[15,9,16,9],[15,10,16,10],[15,11,16,11],[15,12,16,12]]}
[]
[null,null,"Risicomatrix"]
[null,null,null,null,null,null,null,null,null,"Kans van voorkomen"]
[]
[null,null,null,null,null,null,null,null,null,"A","B","C","D","E","F"]
[null,null,"Bedrijfswaarden / Organisatiewaarden",null,null,null,null,null,null,"Zeer laag","Laag","Beperkt","Geregeld","Vaak","Zeer vaak"]
[null,null,"Financieel","Doelmatig","Kwantiteit/Veilig","Kwal leefomgeving","Imago","Circulair",null,"> 0,001 / jr","> 0,01 / jr","> 0,1 /jr","> 1 / jr","> 10 / jr","> 100 / jr"]
["Effecten / gevolgen","Catastrofaal",">=",null,null,null,null,null,6,"M","H","ZH","O","O","O"]
{"$rows_left_out":13}
{"sheet":"Stap 2 Register","index":2,"n_rows":109,"n_cols":50,"rows_kept":109,"cut":false,"hidden":false,"merged":[[5,2,6,2],[5,1,6,1],[5,3,6,3],[5,22,5,27],[5,15,5,21],[5,13,6,13],[5,14,6,14],[5,7,5,12],[5,34,6,34],[5,36,6,36],[5,4,6,4],[5,28,5,33],[5,5,6,5],[5,6,6,6]]}
[]
[]
[null,null,"Stap 2: Risicoregister"]
[]
[]
[null,"Risico-nummer","Beschrijving van het risico\nAsset + faalmode","Oorzaak / invloed van","Omschrijving van het effect","Kans","per jaar","Risico coördinaten per bedrijfswaarde",null,null,null,null,null,"Risico","Risico uitgedrukt in\nMonetair Equivalent","risicogetal",null,null,null,null,null,null,"Monetair",null,null,null,null,null,"Risico per bedrijfswaarde",null,null,null,null,null,"Beheersmaat-regel nodig? \n1=ja leeg=nee",null,"Opmerkingen",null,". ",null,null,null,null,null,"mon eq totaal"]
["mon eq voor vert zoeken",null,null,null,null,null,null,{"$f":"'Stap 1 Risicomatrix'!C7","v":"Financieel"},{"$f":"'Stap 1 Risicomatrix'!D7","v":"Doelmatig"},{"$f":"'Stap 1 Risicomatrix'!E7","v":"Kwantiteit/Veilig"},{"$f":"'Stap 1 Risicomatrix'!F7","v":"Kwal leefomgeving"},{"$f":"'Stap 1 Risicomatrix'!G7","v":"Imago"},{"$f":"'Stap 1 Risicomatrix'!H7","v":"Circulair"},null,null,"eur","com","kwan","kwal","im","con","hoogste","eur","com","kwan","kwal","im","con",{"$f":"H7","v":"Financieel"},"Doelmatig","Kwantiteit/Veilig","Kwal leefomgeving","Imago","Circulair",null,"rekenkolom",null,null,"O","ZH","H","M","L","V","O","ZH","H","M","L","V"]
[{"$f":"O8+B8","v":1},1,null,null,null,{"$f":"IF(H8=\"\",\"\",VLOOKUP(H8,matrixtest,6,FALSE))","v":""},{"$f":"IF(H8=\"\",\"\",VLOOKUP(H8,matrixtest,5,FALSE))","v":""},null,null,null,null,null,null,{"$f":"IF(V8=0,\"\",VLOOKUP(V8,risico,2,FALSE))","v":""},{"$f":"SUM(W8:AB8)","v":0},{"$f":"IF(H8=\"\",0,VLOOKUP(H8,matrixtest,4,FALSE))","v":0},{"$f":"IF(I8=\"\",0,VLOOKUP(I8,matrixtest,4,FALSE))","v":0},{"$f":"IF(J8=\"\",0,VLOOKUP(J8,matrixtest,4,FALSE))","v":0},{"$f":"IF(K8=\"\",0,VLOOKUP(K8,matrixtest,4,FALSE))","v":0},{"$f":"IF(L8=\"\",0,VLOOKUP(L8,matrixtest,4,FALSE))","v":0},{"$f":"IF(M8=\"\",0,VLOOKUP(M8,matrixtest,4,FALSE))","v":0},{"$f":"MAX(P8:U8)","v":0},{"$f":"IF(H8=\"\",0,VLOOKUP(H8,matrixtest,2,FALSE))","v":0},{"$f":"IF(I8=\"\",0,VLOOKUP(I8,matrixtest,2,FALSE))","v":0},{"$f":"IF(J8=\"\",0,VLOOKUP(J8,matrixtest,2,FALSE))","v":0},{"$f":"IF(K8=\"\",0,VLOOKUP(K8,matrixtest,2,FALSE))","v":0},{"$f":"IF(L8=\"\",0,VLOOKUP(L8,matrixtest,2,FALSE))","v":0},{"$f":"IF(M8=\"\",0,VLOOKUP(M8,matrixtest,2,FALSE))","v":0},{"$f":"IF(H8=\"\",\"\",VLOOKUP(H8,matrixtest,3,FALSE))","v":""},{"$f":"IF(I8=\"\",\"\",VLOOKUP(I8,matrixtest,3,FALSE))","v":""},{"$f":"IF(J8=\"\",\"\",VLOOKUP(J8,matrixtest,3,FALSE))","v":""},{"$f":"IF(K8=\"\",\"\",VLOOKUP(K8,matrixtest,3,FALSE))","v":""},{"$f":"IF(L8=\"\",\"\",VLOOKUP(L8,matrixtest,3,FALSE))","v":""},{"$f":"IF(M8=\"\",\"\",VLOOKUP(M8,matrixtest,3,FALSE))","v":""},null,{"$f":"AI8","v":0},null,null,{"$f":"IF($N8=$AM$7,_xlfn.TEXTJOIN($AM$6,,$B8,$C8),\"\")","v":""},{"$f":"IF($N8=$AN$7,_xlfn.TEXTJOIN($AM$6,,$B8,$C8),\"\")","v":""},{"$f":"IF($N8=$AO$7,_xlfn.TEXTJOIN($AM$6,,$B8,$C8),\"\")","v":""},{"$f":"IF($N8=$AP$7,_xlfn.TEXTJOIN($AM$6,,$B8,$C8),\"\")","v":""},{"$f":"IF($N8=$AQ$7,_xlfn.TEXTJOIN($AM$6,,$B8,$C8),\"\")","v":""},{"$f":"IF($N8=$AR$7,_xlfn.TEXTJOIN($AM$6,,$B8,$C8),\"\")","v":""},{"$f":"SUMIF($N$8:$N$107,AS7,$O$8:$O$107)","v":0},0,0,0,0,0]
{"$rows_left_out":102}
{"sheet":"Stap 3 Maatregelen","index":3,"n_rows":109,"n_cols":52,"rows_kept":109,"cut":false,"hidden":false,"merged":[[2,11,2,13],[5,38,6,38],[5,16,6,16],[5,9,5,14],[5,2,6,2],[5,3,6,3],[5,7,6,7],[5,8,6,8],[5,5,6,5],[5,15,6,15],[5,18,6,18],[5,19,5,25],[5,26,5,31],[5,32,5,37]]}
[]
[]
[null,null,null,"Stap 3: Maatregelen"]
[]
[]
[null,null,"Risico-nummer","Risico",null,"Omschrijving van de maatregel",null,"Kans","per jaar","Risico coördinaten per bedrijfswaarde NA het nemen van de maatregel",null,null,null,null,null,"Risico","Toegevoegde waarde \nper Euro",null,"Nieuwe risico uitgedrukt in\nMonetair Equivalent","risicogetal",null,null,null,null,null,null,"Monetair",null,null,null,null,null,"Risico per bedrijfswaarde NA het nemen van maatregelen",null,null,null,null,null,"Wat verandert de maatregel aan het huidige risico?",". "]
["rekenkolom","mon equ",null,null,"Effect van het risico",null,"Kosten van de maatregel",null,null,{"$f":"'Stap 1 Risicomatrix'!C7","v":"Financieel"},{"$f":"'Stap 1 Risicomatrix'!D7","v":"Doelmatig"},{"$f":"'Stap 1 Risicomatrix'!E7","v":"Kwantiteit/Veilig"},{"$f":"'Stap 1 Risicomatrix'!F7","v":"Kwal leefomgeving"},{"$f":"'Stap 1 Risicomatrix'!G7","v":"Imago"},{"$f":"'Stap 1 Risicomatrix'!H7","v":"Circulair"},null,null,"Oude ME",null,"eur","com","kwan","kwal","im","con","hoogste","eur","com","kwan","kwal","im","con",{"$f":"J7","v":"Financieel"},"Doelmatig","Kwantiteit/Veilig","Kwal leefomgeving","Imago","Circulair",null,null,"O","ZH","H","M","L","V","O","ZH","H","M","L","V"]
[1,{"$f":"_xlfn.XLOOKUP(A8,'Stap 2 Register'!$AJ$8:$AJ$107,'Stap 2 Register'!$A$8:$A$107)","v":{"$error":"#N/A"}},{"$f":"_xlfn.IFNA(_xlfn.XLOOKUP(B8,'Stap 2 Register'!$A$8:$A$107,'Stap 2 Register'!$B$8:$B$107),\"\")","v":""},{"$f":"_xlfn.IFNA(_xlfn.XLOOKUP(B8,'Stap 2 Register'!$A$8:$A$107,'Stap 2 Register'!$C$8:$C$107),\"\")","v":""},{"$f":"_xlfn.IFNA(_xlfn.XLOOKUP(B8,'Stap 2 Register'!$A$8:$A$107,'Stap 2 Register'!$E$8:$E$107),\"\")","v":""},null,0,{"$f":"IF(J8=\"\",\"\",VLOOKUP(J8,matrixtest,6,FALSE))","v":""},{"$f":"IF(J8=\"\",\"\",VLOOKUP(J8,matrixtest,5,FALSE))","v":""},null,null,null,null,null,null,{"$f":"IF(Z8=0,\"\",VLOOKUP(Z8,risico,2,FALSE))","v":""},{"$f":"IF(G8=0,\"\",IF((R8-S8)<0,(G8/(R8-S8)),((R8-S8)/G8)))","v":""},{"$f":"VLOOKUP($B8,'Stap 2 Register'!$A$8:$AK$107,15,0)","v":{"$error":"#N/A"}},{"$f":"SUM(AA8:AF8)","v":0},{"$f":"IF(J8=\"\",0,VLOOKUP(J8,matrixtest,4,FALSE))","v":0},{"$f":"IF(K8=\"\",0,VLOOKUP(K8,matrixtest,4,FALSE))","v":0},{"$f":"IF(L8=\"\",0,VLOOKUP(L8,matrixtest,4,FALSE))","v":0},{"$f":"IF(M8=\"\",0,VLOOKUP(M8,matrixtest,4,FALSE))","v":0},{"$f":"IF(N8=\"\",0,VLOOKUP(N8,matrixtest,4,FALSE))","v":0},{"$f":"IF(O8=\"\",0,VLOOKUP(O8,matrixtest,4,FALSE))","v":0},{"$f":"MAX(T8:Y8)","v":0},{"$f":"IF(J8=\"\",0,VLOOKUP(J8,matrixtest,2,FALSE))","v":0},{"$f":"IF(K8=\"\",0,VLOOKUP(K8,matrixtest,2,FALSE))","v":0},{"$f":"IF(L8=\"\",0,VLOOKUP(L8,matrixtest,2,FALSE))","v":0},{"$f":"IF(M8=\"\",0,VLOOKUP(M8,matrixtest,2,FALSE))","v":0},{"$f":"IF(N8=\"\",0,VLOOKUP(N8,matrixtest,2,FALSE))","v":0},{"$f":"IF(O8=\"\",0,VLOOKUP(O8,matrixtest,2,FALSE))","v":0},{"$f":"IF(J8=\"\",\"\",VLOOKUP(J8,matrixtest,3,FALSE))","v":""},{"$f":"IF(K8=\"\",\"\",VLOOKUP(K8,matrixtest,3,FALSE))","v":""},{"$f":"IF(L8=\"\",\"\",VLOOKUP(L8,matrixtest,3,FALSE))","v":""},{"$f":"IF(M8=\"\",\"\",VLOOKUP(M8,matrixtest,3,FALSE))","v":""},{"$f":"IF(N8=\"\",\"\",VLOOKUP(N8,matrixtest,3,FALSE))","v":""},{"$f":"IF(O8=\"\",\"\",VLOOKUP(O8,matrixtest,3,FALSE))","v":""},null,null,{"$f":"IF($P8=$AO$7,_xlfn.TEXTJOIN($AN$6,,$C8,$D8),\"\")","v":""},{"$f":"IF($P8=$AP$7,_xlfn.TEXTJOIN($AN$6,,$C8,$D8),\"\")","v":""},{"$f":"IF($P8=$AQ$7,_xlfn.TEXTJOIN($AN$6,,$C8,$D8),\"\")","v":""},{"$f":"IF($P8=$AR$7,_xlfn.TEXTJOIN($AN$6,,$C8,$D8),\"\")","v":""},{"$f":"IF($P8=$AS$7,_xlfn.TEXTJOIN($AN$6,,$C8,$D8),\"\")","v":""},{"$f":"IF($P8=$AT$7,_xlfn.TEXTJOIN($AN$6,,$C8,$D8),\"\")","v":""},{"$f":"SUMIF($P$8:$P$107,AU7,$S$8:$S$107)","v":0},0,0,0,0,0]
{"$rows_left_out":102}
{"sheet":"Overgebleven risico","index":4,"n_rows":109,"n_cols":22,"rows_kept":109,"cut":false,"hidden":true,"merged":[[5,3,6,3],[5,1,6,1],[5,2,6,2]]}
[]
[]
[null,null,"Overgebleven risico's"]
[]
[]
[null,"Risico-nummer","Omschrijving risico","Risico","monetair",null,null,null,null,". "]
["mon equ",null,null,null,{"$f":"'Stap 2 Register'!AC7","v":"Financieel"},{"$f":"'Stap 2 Register'!AD7","v":"Doelmatig"},{"$f":"'Stap 2 Register'!AE7","v":"Kwantiteit/Veilig"},{"$f":"'Stap 2 Register'!AF7","v":"Kwal leefomgeving"},{"$f":"'Stap 2 Register'!AG7","v":"Imago"},{"$f":"'Stap 2 Register'!AH7","v":"Circulair"},"O","ZH","H","M","L","V","O","ZH","H","M","L","V"]
[{"$f":"IF('1e berekening'!G3=0,'1e berekening'!B3,0)","v":100},{"$f":"IF(A8=0,\"\",VLOOKUP($A8,'Stap 2 Register'!$A$8:$AK$107,2,0))","v":100},{"$f":"IF(A8=0,0,VLOOKUP($A8,'Stap 2 Register'!$A$8:$AK$107,3,0))","v":0},{"$f":"IF(A8=0,\"\",VLOOKUP($A8,'Stap 2 Register'!$A$8:$AK$107,14,0))","v":""},{"$f":"IF(A8=0,0,VLOOKUP($A8,'Stap 2 Register'!$A$8:$AK$107,23,0))","v":0},{"$f":"IF(A8=0,0,VLOOKUP($A8,'Stap 2 Register'!$A$8:$AK$107,24,0))","v":0},{"$f":"IF(A8=0,0,VLOOKUP($A8,'Stap 2 Register'!$A$8:$AK$107,25,0))","v":0},{"$f":"IF(A8=0,0,VLOOKUP($A8,'Stap 2 Register'!$A$8:$AK$107,26,0))","v":0},{"$f":"IF(A8=0,0,VLOOKUP($A8,'Stap 2 Register'!$A$8:$AK$107,27,0))","v":0},{"$f":"IF(A8=0,0,VLOOKUP($A8,'Stap 2 Register'!$A$8:$AK$107,28,0))","v":0},{"$f":"IF($D8=$K$7,_xlfn.TEXTJOIN($J$6,,$B8,$C8),\"\")","v":""},{"$f":"IF($D8=$L$7,_xlfn.TEXTJOIN($J$6,,$B8,$C8),\"\")","v":""},{"$f":"IF($D8=$M$7,_xlfn.TEXTJOIN($J$6,,$B8,$C8),\"\")","v":""},{"$f":"IF($D8=$N$7,_xlfn.TEXTJOIN($J$6,,$B8,$C8),\"\")","v":""},{"$f":"IF($D8=$O$7,_xlfn.TEXTJOIN($J$6,,$B8,$C8),\"\")","v":""},{"$f":"IF($D8=$P$7,_xlfn.TEXTJOIN($J$6,,$B8,$C8),\"\")","v":""},{"$f":"SUMIF($D$8:$D$107,Q7,$A$8:$A$107)","v":0},0,0,0,0,0]
{"$rows_left_out":102}
{"sheet":"1e berekening","index":5,"n_rows":106,"n_cols":15,"rows_kept":106,"cut":false,"hidden":true,"merged":[]}
[null,null,null,null,null,null,null,null,null,"risico",". "]
["Mon eq","monetair op volgorde","risiconummer","risico beschrijving","Effect","risico","selectie",null,null,"O","ZH","H","M","L","V"]
[{"$f":"IF(G3=1,B3,0)","v":0},{"$f":"LARGE('Stap 2 Register'!$A$8:$A$107,'Stap 2 Register'!B8)","v":100},{"$f":"VLOOKUP($B3,'Stap 2 Register'!$A$8:$AK$107,2,0)","v":100},{"$f":"VLOOKUP($B3,'Stap 2 Register'!$A$8:$AK$107,3,0)","v":0},{"$f":"VLOOKUP($B3,'Stap 2 Register'!$A$8:$AK$107,5,0)","v":0},{"$f":"VLOOKUP($B3,'Stap 2 Register'!$A$8:$AK$107,14,0)","v":""},{"$f":"VLOOKUP($B3,'Stap 2 Register'!$A$8:$AK$107,35,0)","v":0},null,null,{"$f":"IF($F3=$J$2,_xlfn.TEXTJOIN($K$1,,$C3:$D3),\"\")","v":""},{"$f":"IF($F3=$K$2,_xlfn.TEXTJOIN($K$1,,$C3:$D3),\"\")","v":""},{"$f":"IF($F3=$L$2,_xlfn.TEXTJOIN($K$1,,$C3:$D3),\"\")","v":""},{"$f":"IF($F3=$M$2,_xlfn.TEXTJOIN($K$1,,$C3:$D3),\"\")","v":""},{"$f":"IF($F3=$N$2,_xlfn.TEXTJOIN($K$1,,$C3:$D3),\"\")","v":""},{"$f":"IF($F3=$O$2,_xlfn.TEXTJOIN($K$1,,$C3:$D3),\"\")","v":""}]
[{"$f":"IF(G4=1,B4,0)","v":0},{"$f":"LARGE('Stap 2 Register'!$A$8:$A$107,'Stap 2 Register'!B9)","v":99},{"$f":"VLOOKUP($B4,'Stap 2 Register'!$A$8:$AK$107,2,0)","v":99},{"$f":"VLOOKUP($B4,'Stap 2 Register'!$A$8:$AK$107,3,0)","v":0},{"$f":"VLOOKUP($B4,'Stap 2 Register'!$A$8:$AK$107,5,0)","v":0},{"$f":"VLOOKUP($B4,'Stap 2 Register'!$A$8:$AK$107,14,0)","v":""},{"$f":"VLOOKUP($B4,'Stap 2 Register'!$A$8:$AK$107,35,0)","v":0},null,null,"","","","","",""]
[0,{"$f":"LARGE('Stap 2 Register'!$A$8:$A$107,'Stap 2 Register'!B10)","v":98},{"$f":"VLOOKUP($B5,'Stap 2 Register'!$A$8:$AK$107,2,0)","v":98},{"$f":"VLOOKUP($B5,'Stap 2 Register'!$A$8:$AK$107,3,0)","v":0},{"$f":"VLOOKUP($B5,'Stap 2 Register'!$A$8:$AK$107,5,0)","v":0},{"$f":"VLOOKUP($B5,'Stap 2 Register'!$A$8:$AK$107,14,0)","v":""},{"$f":"VLOOKUP($B5,'Stap 2 Register'!$A$8:$AK$107,35,0)","v":0},null,null,"","","","","",""]
[0,{"$f":"LARGE('Stap 2 Register'!$A$8:$A$107,'Stap 2 Register'!B11)","v":97},{"$f":"VLOOKUP($B6,'Stap 2 Register'!$A$8:$AK$107,2,0)","v":97},{"$f":"VLOOKUP($B6,'Stap 2 Register'!$A$8:$AK$107,3,0)","v":0},{"$f":"VLOOKUP($B6,'Stap 2 Register'!$A$8:$AK$107,5,0)","v":0},{"$f":"VLOOKUP($B6,'Stap 2 Register'!$A$8:$AK$107,14,0)","v":""},{"$f":"VLOOKUP($B6,'Stap 2 Register'!$A$8:$AK$107,35,0)","v":0},null,null,"","","","","",""]
[0,{"$f":"LARGE('Stap 2 Register'!$A$8:$A$107,'Stap 2 Register'!B12)","v":96},{"$f":"VLOOKUP($B7,'Stap 2 Register'!$A$8:$AK$107,2,0)","v":96},{"$f":"VLOOKUP($B7,'Stap 2 Register'!$A$8:$AK$107,3,0)","v":0},{"$f":"VLOOKUP($B7,'Stap 2 Register'!$A$8:$AK$107,5,0)","v":0},{"$f":"VLOOKUP($B7,'Stap 2 Register'!$A$8:$AK$107,14,0)","v":""},{"$f":"VLOOKUP($B7,'Stap 2 Register'!$A$8:$AK$107,35,0)","v":0},null,null,"","","","","",""]
[0,{"$f":"LARGE('Stap 2 Register'!$A$8:$A$107,'Stap 2 Register'!B13)","v":95},{"$f":"VLOOKUP($B8,'Stap 2 Register'!$A$8:$AK$107,2,0)","v":95},{"$f":"VLOOKUP($B8,'Stap 2 Register'!$A$8:$AK$107,3,0)","v":0},{"$f":"VLOOKUP($B8,'Stap 2 Register'!$A$8:$AK$107,5,0)","v":0},{"$f":"VLOOKUP($B8,'Stap 2 Register'!$A$8:$AK$107,14,0)","v":""},{"$f":"VLOOKUP($B8,'Stap 2 Register'!$A$8:$AK$107,35,0)","v":0},null,null,"","","","","",""]
{"$rows_left_out":99}
{"sheet":"Dashboard","index":7,"n_rows":94,"n_cols":16,"rows_kept":94,"cut":false,"hidden":false,"merged":[[34,1,35,2],[32,10,32,12],[31,10,31,12],[10,1,11,1],[10,2,11,2],[34,4,35,4],[34,6,35,6],[34,8,35,8],[34,10,35,10],[34,12,35,12],[9,12,26,12],[9,4,26,4],[9,6,26,6],[9,8,26,8],[9,10,26,10],[34,14,35,14],[9,14,26,14]]}
[]
[]
[null,null,"Dashboard"]
[]
[]
[null,null,null,null,null,null," \n"]
[null,null,null,null,"Ontoelaatbaar",null,"Zeer Hoog",null,"Hoog",null,"Middelmatig",null,"Laag",null,"Verwaarloosbaar"]
[null,null,null,null,"O",null,"ZH",null,"H",null,"M",null,"L",null,"V"]
{"$rows_left_out":87}
{"sheet":"Verantwoording","index":8,"n_rows":50,"n_cols":12,"rows_kept":50,"cut":false,"hidden":false,"merged":[[5,1,12,11],[15,1,24,11],[27,1,36,11],[39,1,48,11]]}
[]
[null,"Verantwoording"]
[]
[]
[null,"De risicomatrix"]
[null,"Voor een goede werking van dit model is uitgegaan van een 6x6 risicomatrix. Dit kan niet worden aangepast in deze versie. Indien u dat wenst, neem dan contact op. Enkel de financiële kolom kan worden aangepast door de \"kosten\" in het geel gekleurde veld aan te passen aan uw eigen model. (Vuistregel daarbij: 1% van uw jaarlijkse begroting op de plek waar de kosten ingevuld kunnen worden, bijvoorbeeld bij een totale begroting van 100 miljoen vult u 1.000.000 in). \n\nU heeft voor het gebruik een eigen risicomatrix nodig. Zonder eigen matrix is het niet mogelijk om het risicoregister zinvol in te vullen. Heeft u nog geen eigen matrix, maar wilt u deze wel hebben, dan kan LEAM u ondersteunen. U kunt de overige bedrijfswaarden veranderen in uw eigen bedrijfswaarden.\n\nDe risicomatrix is logaritmisch opgebouwd. Zowel de kans als het effect wordt bij iedere stap 10x zo groot of klein. Ook is uitgegaan dat alle bedrijfswaarden per effectniveau een zelfde \"gewicht\" of \"zwaarte\" hebben. Dit maakt de matrix om meerdere redenen goed bruikbaar en als bijkomend voordeel is het dan mogelijk om het Monetair Equivalent (het risico uitgedrukt in kosten) zichtbaar te maken.\n\nLegenda van de risico's:\nO = Ontoelaatbaar\nZH = Zeer Hoog\nH = Hoog\nM = Middelmatig\nL = Laag\nV = Verwaarloosbaar"]
[]
[]
{"$rows_left_out":43}
{"sheet":"BW tabel","index":9,"n_rows":38,"n_cols":17,"rows_kept":38,"cut":false,"hidden":true,"merged":[]}
[]
[null,"Risico-coördinaat","Mon. Eq.","Risico","Risicogetal","kans","kans2","Letter","Getal",null,"Monetaire waarde kolom D6","Kans D6"]
[null,"A6",{"$f":"C24","v":31622.776601683796},"M",{"$f":"E24","v":32},{"$f":"F21/1000","v":3.1622776601683794E-3},"Zeer laag","A",6,null,{"$f":"'Stap 1 Risicomatrix'!C9","v":10000000},10]
[null,"A5",{"$f":"C25","v":3162.2776601683795},"L",{"$f":"E25","v":16},3.1622776601683794E-3,"Zeer laag","A",5]
[null,"A4",{"$f":"C26","v":316.22776601683796},"V",{"$f":"E26","v":8},3.1622776601683794E-3,"Zeer laag","A",4]
[null,"A3",{"$f":"C26/10","v":31.622776601683796},"V",{"$f":"E13","v":4},3.1622776601683794E-3,"Zeer laag","A",3]
[null,"A2",{"$f":"C26/100","v":3.1622776601683795},"V",{"$f":"E14","v":2},3.1622776601683794E-3,"Zeer laag","A",2]
[null,"A1",{"$f":"C26/1000","v":0.31622776601683794},"V",1,3.1622776601683794E-3,"Zeer laag","A",1,null,null,"A","B","C","D","E","F"]
{"$rows_left_out":31}
{"sheet":"Grafiek","index":10,"n_rows":110,"n_cols":10,"rows_kept":110,"cut":false,"hidden":true,"merged":[]}
[null,{"$f":"'Stap 1 Risicomatrix'!C7","v":"Financieel"},{"$f":"'Stap 1 Risicomatrix'!D7","v":"Doelmatig"},{"$f":"'Stap 1 Risicomatrix'!E7","v":"Kwantiteit/Veilig"},{"$f":"'Stap 1 Risicomatrix'!F7","v":"Kwal leefomgeving"},{"$f":"'Stap 1 Risicomatrix'!G7","v":"Imago"},{"$f":"'Stap 1 Risicomatrix'!H7","v":"Circulair"}]
["Huidig risico",{"$f":"'Stap 2 Register'!W109","v":0},{"$f":"'Stap 2 Register'!X109","v":0},{"$f":"'Stap 2 Register'!Y109","v":0},{"$f":"'Stap 2 Register'!Z109","v":0},{"$f":"'Stap 2 Register'!AA109","v":0},{"$f":"'Stap 2 Register'!AB109","v":0}]
["Verwacht risico",{"$f":"IF(Dashboard!$C$13=1,'Stap 3 Maatregelen'!AA109+'Overgebleven risico'!E109,0)","v":0},{"$f":"IF(Dashboard!$C$13=1,'Stap 3 Maatregelen'!AB109+'Overgebleven risico'!F109,0)","v":0},{"$f":"IF(Dashboard!$C$13=1,'Stap 3 Maatregelen'!AC109+'Overgebleven risico'!G109,0)","v":0},{"$f":"IF(Dashboard!$C$13=1,'Stap 3 Maatregelen'!AD109+'Overgebleven risico'!H109,0)","v":0},{"$f":"IF(Dashboard!$C$13=1,'Stap 3 Maatregelen'!AE109+'Overgebleven risico'!I109,0)","v":0},{"$f":"IF(Dashboard!$C$13=1,'Stap 3 Maatregelen'!AF109+'Overgebleven risico'!J109,0)","v":0}]
[]
[]
[]
[]
[]
{"$rows_left_out":102}